{"text_format":"1","workbook":"xlsx","n_sheets":13,"sheets":["LICENSE","(1)Table of Contents","Lease Input","Occupancy Costs","(4)Lease A Owner","(5)Lease B Input","(6)Lease B Tenant","(7)Lease B Owner","(8)Lease C Input","(9)Lease C Tenant","(10)Lease C Owner","(11)Before Tax Summary","(12)After Tax Summary"],"not_rendered":{"charts":0,"images":1,"macros":1,"external_links":0,"defined_names":1,"comments":0,"pivot_tables":0},"unopened":[],"bounds":{"document_bytes":16777216,"sheet_cells":100000,"rows_first":2000,"rows_last":500,"rows_between":2000,"halvings":0,"cell_chars":16384,"cell_head_chars":4096},"cells_cut":0,"cells_raw":0,"read":"whole","date_system":"1900"}

{"sheet":"LICENSE","index":0,"n_rows":0,"n_cols":0,"rows_kept":0,"cut":false,"hidden":true,"merged":[]}

{"sheet":"(1)Table of Contents","index":1,"n_rows":0,"n_cols":0,"rows_kept":0,"cut":false,"hidden":true,"merged":[]}

{"sheet":"Lease Input","index":2,"n_rows":135,"n_cols":14,"rows_kept":135,"cut":false,"hidden":false,"merged":[[41,1,41,2],[36,1,36,2],[23,1,23,2],[7,5,7,6],[1,1,1,2],[22,1,22,2],[31,1,31,2],[2,1,2,2]]}
[]
[null,{"$f":"CONCATENATE(\"Lease Input Sheet - \",TEXT(TODAY(),\"m/d/yyyy\"))","v":"Lease Input Sheet - 8/16/2021"}]
[null,"Lease Assumptions"]
[null,1,"Lease Term in Years",null,null,null,100]
[null,2,"Rentable Square Feet"]
[null,3,"Base Rent"]
{"$rows_left_out":130}
{"sheet":"Occupancy Costs","index":3,"n_rows":35,"n_cols":14,"rows_kept":35,"cut":false,"hidden":false,"merged":[[1,1,1,3],[29,1,29,2],[29,3,29,4],[29,5,29,6],[3,1,3,2],[2,1,2,2],[22,1,22,2],[13,1,13,2]]}
[]
[null,"Occupancy Cost Spreadsheet"]
[null,"Total Occupancy Costs"]
[null,"End of Year",null,"0",1,2,3,4,5,6,7,8,9,10]
[null,1,"Base Rent",null,{"$f":"IF('Lease Input'!D6<'Lease Input'!G4,'Lease Input'!D5*'Lease Input'!D6,'Lease Input'!D6)","v":0},{"$f":"IF(F4<='Lease Input'!$D$4,IF('Lease Input'!$D$7>0,'Occupancy Costs'!E5+('Lease Input'!$D$5*'Lease Input'!$D$7),E5*(1+'Lease Input'!F25)),0)","v":0},{"$f":"IF(G4<='Lease Input'!$D$4,IF('Lease Input'!$D$7>0,'Occupancy Costs'!F5+('Lease Input'!$D$5*'Lease Input'!$D$7),F5*(1+'Lease Input'!G25)),0)","v":0},{"$f":"IF(H4<='Lease Input'!$D$4,IF('Lease Input'!$D$7>0,'Occupancy Costs'!G5+('Lease Input'!$D$5*'Lease Input'!$D$7),G5*(1+'Lease Input'!H25)),0)","v":0},{"$f":"IF(I4<='Lease Input'!$D$4,IF('Lease Input'!$D$7>0,'Occupancy Costs'!H5+('Lease Input'!$D$5*'Lease Input'!$D$7),H5*(1+'Lease Input'!I25)),0)","v":0},{"$f":"IF(J4<='Lease Input'!$D$4,IF('Lease Input'!$D$7>0,'Occupancy Costs'!I5+('Lease Input'!$D$5*'Lease Input'!$D$7),I5*(1+'Lease Input'!J25)),0)","v":0},{"$f":"IF(K4<='Lease Input'!$D$4,IF('Lease Input'!$D$7>0,'Occupancy Costs'!J5+('Lease Input'!$D$5*'Lease Input'!$D$7),J5*(1+'Lease Input'!K25)),0)","v":0},{"$f":"IF(L4<='Lease Input'!$D$4,IF('Lease Input'!$D$7>0,'Occupancy Costs'!K5+('Lease Input'!$D$5*'Lease Input'!$D$7),K5*(1+'Lease Input'!L25)),0)","v":0},{"$f":"IF(M4<='Lease Input'!$D$4,IF('Lease Input'!$D$7>0,'Occupancy Costs'!L5+('Lease Input'!$D$5*'Lease Input'!$D$7),L5*(1+'Lease Input'!M25)),0)","v":0},{"$f":"IF(N4<='Lease Input'!$D$4,IF('Lease Input'!$D$7>0,'Occupancy Costs'!M5+('Lease Input'!$D$5*'Lease Input'!$D$7),M5*(1+'Lease Input'!N25)),0)","v":0}]
[null,2,"+Percentage Rent",null,{"$f":"MAX(0,('Lease Input'!$D$22*'Lease Input'!$D$5-'Lease Input'!$F$22)*'Lease Input'!$E$22)","v":0},{"$f":"IF(F4<='Lease Input'!$D$4,MAX(0,(('Lease Input'!$D$22*'Lease Input'!$D$5*(1+'Lease Input'!$F$31)-'Lease Input'!$F$22))*'Lease Input'!$E$22),0)","v":0},{"$f":"IF(G4<='Lease Input'!D5,MAX(0,((('Lease Input'!$D$22*'Lease Input'!$D$5*(1+'Lease Input'!$F$31)*(1+'Lease Input'!$G$31)-'Lease Input'!$F$22)))*'Lease Input'!$E$22),0)","v":0},{"$f":"IF(H4<='Lease Input'!D4,MAX(0,(((('Lease Input'!$D$22*'Lease Input'!$D$5*(1+'Lease Input'!$F$31)*(1+'Lease Input'!$G$31)*(1+'Lease Input'!$H$31)-'Lease Input'!$F$22))))*'Lease Input'!$E$22),0)","v":0},{"$f":"IF(I4<='Lease Input'!D4,MAX(0,((((('Lease Input'!$D$22*'Lease Input'!$D$5*(1+'Lease Input'!$F$31)*(1+'Lease Input'!$G$31)*(1+'Lease Input'!$H$31)*(1+'Lease Input'!$I$31)-'Lease Input'!$F$22)))))*'Lease Input'!$E$22),0)","v":0},{"$f":"IF(J4<='Lease Input'!D4,MAX(0,(((((('Lease Input'!$D$22*'Lease Input'!$D$5*(1+'Lease Input'!$F$31)*(1+'Lease Input'!$G$31)*(1+'Lease Input'!$H$31)*(1+'Lease Input'!$I$31)*(1+'Lease Input'!$J$31)-'Lease Input'!$F$22))))))*'Lease Input'!$E$22),0)","v":0},{"$f":"IF(K4<='Lease Input'!D4,MAX(0,((((((('Lease Input'!$D$22*'Lease Input'!$D$5*(1+'Lease Input'!$F$31)*(1+'Lease Input'!$G$31)*(1+'Lease Input'!$H$31)*(1+'Lease Input'!$I$31)*(1+'Lease Input'!$J$31)*(1+'Lease Input'!$K$31)-'Lease Input'!$F$22)))))))*'Lease Input'!$E$22),0)","v":0},{"$f":"IF(L4<='Lease Input'!D4,MAX(0,(((((((('Lease Input'!$D$22*'Lease Input'!$D$5*(1+'Lease Input'!$F$31)*(1+'Lease Input'!$G$31)*(1+'Lease Input'!$H$31)*(1+'Lease Input'!$I$31)*(1+'Lease Input'!$J$31)*(1+'Lease Input'!$K$31)*(1+'Lease Input'!$L$31)-'Lease Input'!$F$22))))))))*'Lease Input'!$E$22),0)","v":0},{"$f":"IF(M4<='Lease Input'!D4,MAX(0,((((((((('Lease Input'!$D$22*'Lease Input'!$D$5*(1+'Lease Input'!$F$31)*(1+'Lease Input'!$G$31)*(1+'Lease Input'!$H$31)*(1+'Lease Input'!$I$31)*(1+'Lease Input'!$J$31)*(1+'Lease Input'!$K$31)*(1+'Lease Input'!$L$31)*(1+'Lease Input'!$M$31)-'Lease Input'!$F$22)))))))))*'Lease Input'!$E$22),0)","v":0},{"$f":"IF(N4<='Lease Input'!D4,MAX(0,(((((((((('Lease Input'!$D$22*'Lease Input'!$D$5*(1+'Lease Input'!$F$31)*(1+'Lease Input'!$G$31)*(1+'Lease Input'!$H$31)*(1+'Lease Input'!$I$31)*(1+'Lease Input'!$J$31)*(1+'Lease Input'!$K$31)*(1+'Lease Input'!$L$31)*(1+'Lease Input'!$M$31)*(1+'Lease Input'!$N$31)-'Lease Input'!$F$22))))))))))*'Lease Input'!$E$22),0)","v":0}]
{"$rows_left_out":30}
{"sheet":"(4)Lease A Owner","index":4,"n_rows":29,"n_cols":14,"rows_kept":29,"cut":false,"hidden":true,"merged":[[1,1,1,4],[2,1,2,2],[10,1,10,2],[27,5,27,6],[19,1,19,2],[27,1,27,2],[3,1,3,2],[27,3,27,4]]}
[]
[null,"Lease \"A\" Owner Spreadsheet"]
[null,"Collections"]
[null,"End of Year",null,"0",1,2,3,4,5,6,7,8,9,10]
[null,1,"Base Rent",null,{"$f":"'Occupancy Costs'!E5","v":0},{"$f":"'Occupancy Costs'!F5","v":0},{"$f":"'Occupancy Costs'!G5","v":0},{"$f":"'Occupancy Costs'!H5","v":0},{"$f":"'Occupancy Costs'!I5","v":0},{"$f":"'Occupancy Costs'!J5","v":0},{"$f":"'Occupancy Costs'!K5","v":0},{"$f":"'Occupancy Costs'!L5","v":0},{"$f":"'Occupancy Costs'!M5","v":0},{"$f":"'Occupancy Costs'!N5","v":0}]
[null,2,"+Percentage Rent",null,{"$f":"'Occupancy Costs'!E6","v":0},{"$f":"'Occupancy Costs'!F6","v":0},{"$f":"'Occupancy Costs'!G6","v":0},{"$f":"'Occupancy Costs'!H6","v":0},{"$f":"'Occupancy Costs'!I6","v":0},{"$f":"'Occupancy Costs'!J6","v":0},{"$f":"'Occupancy Costs'!K6","v":0},{"$f":"'Occupancy Costs'!L6","v":0},{"$f":"'Occupancy Costs'!M6","v":0},{"$f":"'Occupancy Costs'!N6","v":0}]
{"$rows_left_out":24}
{"sheet":"(5)Lease B Input","index":5,"n_rows":135,"n_cols":14,"rows_kept":135,"cut":false,"hidden":true,"merged":[[41,1,41,2],[36,1,36,2],[23,1,23,2],[7,5,7,6],[1,1,1,2],[22,1,22,2],[31,1,31,2],[2,1,2,2]]}
[]
[null,{"$f":"CONCATENATE(\"Lease B Input Sheet - \",TEXT(TODAY(),\"m/d/yyyy\"))","v":"Lease B Input Sheet - 8/16/2021"}]
[null,"Lease Assumptions"]
[null,1,"Lease Term in Years",null,null,null,100]
[null,2,"Rentable Square Feet"]
[null,3,"Base Rent"]
{"$rows_left_out":130}
{"sheet":"(6)Lease B Tenant","index":6,"n_rows":42,"n_cols":14,"rows_kept":42,"cut":false,"hidden":true,"merged":[[35,1,35,2],[1,1,1,4],[29,1,29,2],[29,3,29,4],[29,5,29,6],[3,1,3,2],[2,1,2,2],[22,1,22,2],[13,1,13,2]]}
[]
[null,"Lease \"B\" Tenant Spreadsheet"]
[null,"Total Occupancy Costs"]
[null,"End of Year",null,"0",1,2,3,4,5,6,7,8,9,10]
[null,1,"Base Rent",null,{"$f":"IF('(5)Lease B Input'!D6<'(5)Lease B Input'!G4,'(5)Lease B Input'!D5*'(5)Lease B Input'!D6,'(5)Lease B Input'!D6)","v":0},{"$f":"IF(F4<='(5)Lease B Input'!$D$4,IF('(5)Lease B Input'!$D$7>0,'(6)Lease B Tenant'!E5+('(5)Lease B Input'!$D$5*'(5)Lease B Input'!$D$7),E5*(1+'(5)Lease B Input'!F25)),0)","v":0},{"$f":"IF(G4<='(5)Lease B Input'!$D$4,IF('(5)Lease B Input'!$D$7>0,'(6)Lease B Tenant'!F5+('(5)Lease B Input'!$D$5*'(5)Lease B Input'!$D$7),F5*(1+'(5)Lease B Input'!G25)),0)","v":0},{"$f":"IF(H4<='(5)Lease B Input'!$D$4,IF('(5)Lease B Input'!$D$7>0,'(6)Lease B Tenant'!G5+('(5)Lease B Input'!$D$5*'(5)Lease B Input'!$D$7),G5*(1+'(5)Lease B Input'!H25)),0)","v":0},{"$f":"IF(I4<='(5)Lease B Input'!$D$4,IF('(5)Lease B Input'!$D$7>0,'(6)Lease B Tenant'!H5+('(5)Lease B Input'!$D$5*'(5)Lease B Input'!$D$7),H5*(1+'(5)Lease B Input'!I25)),0)","v":0},{"$f":"IF(J4<='(5)Lease B Input'!$D$4,IF('(5)Lease B Input'!$D$7>0,'(6)Lease B Tenant'!I5+('(5)Lease B Input'!$D$5*'(5)Lease B Input'!$D$7),I5*(1+'(5)Lease B Input'!J25)),0)","v":0},{"$f":"IF(K4<='(5)Lease B Input'!$D$4,IF('(5)Lease B Input'!$D$7>0,'(6)Lease B Tenant'!J5+('(5)Lease B Input'!$D$5*'(5)Lease B Input'!$D$7),J5*(1+'(5)Lease B Input'!K25)),0)","v":0},{"$f":"IF(L4<='(5)Lease B Input'!$D$4,IF('(5)Lease B Input'!$D$7>0,'(6)Lease B Tenant'!K5+('(5)Lease B Input'!$D$5*'(5)Lease B Input'!$D$7),K5*(1+'(5)Lease B Input'!L25)),0)","v":0},{"$f":"IF(M4<='(5)Lease B Input'!$D$4,IF('(5)Lease B Input'!$D$7>0,'(6)Lease B Tenant'!L5+('(5)Lease B Input'!$D$5*'(5)Lease B Input'!$D$7),L5*(1+'(5)Lease B Input'!M25)),0)","v":0},{"$f":"IF(N4<='(5)Lease B Input'!$D$4,IF('(5)Lease B Input'!$D$7>0,'(6)Lease B Tenant'!M5+('(5)Lease B Input'!$D$5*'(5)Lease B Input'!$D$7),M5*(1+'(5)Lease B Input'!N25)),0)","v":0}]
[null,2,"+Percentage Rent",null,{"$f":"MAX(0,('(5)Lease B Input'!$D$22*'(5)Lease B Input'!$D$5-'(5)Lease B Input'!$F$22)*'(5)Lease B Input'!$E$22)","v":0},{"$f":"IF(F4<='(5)Lease B Input'!$D$4,MAX(0,(('(5)Lease B Input'!$D$22*'(5)Lease B Input'!$D$5*(1+'(5)Lease B Input'!$F$31)-'(5)Lease B Input'!$F$22))*'(5)Lease B Input'!$E$22),0)","v":0},{"$f":"IF(G4<='(5)Lease B Input'!D5,MAX(0,((('(5)Lease B Input'!$D$22*'(5)Lease B Input'!$D$5*(1+'(5)Lease B Input'!$F$31)*(1+'(5)Lease B Input'!$G$31)-'(5)Lease B Input'!$F$22)))*'(5)Lease B Input'!$E$22),0)","v":0},{"$f":"IF(H4<='(5)Lease B Input'!D4,MAX(0,(((('(5)Lease B Input'!$D$22*'(5)Lease B Input'!$D$5*(1+'(5)Lease B Input'!$F$31)*(1+'(5)Lease B Input'!$G$31)*(1+'(5)Lease B Input'!$H$31)-'(5)Lease B Input'!$F$22))))*'(5)Lease B Input'!$E$22),0)","v":0},{"$f":"IF(I4<='(5)Lease B Input'!D4,MAX(0,((((('(5)Lease B Input'!$D$22*'(5)Lease B Input'!$D$5*(1+'(5)Lease B Input'!$F$31)*(1+'(5)Lease B Input'!$G$31)*(1+'(5)Lease B Input'!$H$31)*(1+'(5)Lease B Input'!$I$31)-'(5)Lease B Input'!$F$22)))))*'(5)Lease B Input'!$E$22),0)","v":0},{"$f":"IF(J4<='(5)Lease B Input'!D4,MAX(0,(((((('(5)Lease B Input'!$D$22*'(5)Lease B Input'!$D$5*(1+'(5)Lease B Input'!$F$31)*(1+'(5)Lease B Input'!$G$31)*(1+'(5)Lease B Input'!$H$31)*(1+'(5)Lease B Input'!$I$31)*(1+'(5)Lease B Input'!$J$31)-'(5)Lease B Input'!$F$22))))))*'(5)Lease B Input'!$E$22),0)","v":0},{"$f":"IF(K4<='(5)Lease B Input'!D4,MAX(0,((((((('(5)Lease B Input'!$D$22*'(5)Lease B Input'!$D$5*(1+'(5)Lease B Input'!$F$31)*(1+'(5)Lease B Input'!$G$31)*(1+'(5)Lease B Input'!$H$31)*(1+'(5)Lease B Input'!$I$31)*(1+'(5)Lease B Input'!$J$31)*(1+'(5)Lease B Input'!$K$31)-'(5)Lease B Input'!$F$22)))))))*'(5)Lease B Input'!$E$22),0)","v":0},{"$f":"IF(L4<='(5)Lease B Input'!D4,MAX(0,(((((((('(5)Lease B Input'!$D$22*'(5)Lease B Input'!$D$5*(1+'(5)Lease B Input'!$F$31)*(1+'(5)Lease B Input'!$G$31)*(1+'(5)Lease B Input'!$H$31)*(1+'(5)Lease B Input'!$I$31)*(1+'(5)Lease B Input'!$J$31)*(1+'(5)Lease B Input'!$K$31)*(1+'(5)Lease B Input'!$L$31)-'(5)Lease B Input'!$F$22))))))))*'(5)Lease B Input'!$E$22),0)","v":0},{"$f":"IF(M4<='(5)Lease B Input'!D4,MAX(0,((((((((('(5)Lease B Input'!$D$22*'(5)Lease B Input'!$D$5*(1+'(5)Lease B Input'!$F$31)*(1+'(5)Lease B Input'!$G$31)*(1+'(5)Lease B Input'!$H$31)*(1+'(5)Lease B Input'!$I$31)*(1+'(5)Lease B Input'!$J$31)*(1+'(5)Lease B Input'!$K$31)*(1+'(5)Lease B Input'!$L$31)*(1+'(5)Lease B Input'!$M$31)-'(5)Lease B Input'!$F$22)))))))))*'(5)Lease B Input'!$E$22),0)","v":0},{"$f":"IF(N4<='(5)Lease B Input'!D4,MAX(0,(((((((((('(5)Lease B Input'!$D$22*'(5)Lease B Input'!$D$5*(1+'(5)Lease B Input'!$F$31)*(1+'(5)Lease B Input'!$G$31)*(1+'(5)Lease B Input'!$H$31)*(1+'(5)Lease B Input'!$I$31)*(1+'(5)Lease B Input'!$J$31)*(1+'(5)Lease B Input'!$K$31)*(1+'(5)Lease B Input'!$L$31)*(1+'(5)Lease B Input'!$M$31)*(1+'(5)Lease B Input'!$N$31)-'(5)Lease B Input'!$F$22))))))))))*'(5)Lease B Input'!$E$22),0)","v":0}]
{"$rows_left_out":37}
{"sheet":"(7)Lease B Owner","index":7,"n_rows":29,"n_cols":14,"rows_kept":29,"cut":false,"hidden":true,"merged":[[1,1,1,4],[2,1,2,2],[10,1,10,2],[27,5,27,6],[19,1,19,2],[27,1,27,2],[3,1,3,2],[27,3,27,4]]}
[]
[null,"Lease \"B\" Owner Spreadsheet"]
[null,"Collections"]
[null,"End of Year",null,"0",1,2,3,4,5,6,7,8,9,10]
[null,1,"Base Rent",null,{"$f":"'(6)Lease B Tenant'!E5","v":0},{"$f":"'(6)Lease B Tenant'!F5","v":0},{"$f":"'(6)Lease B Tenant'!G5","v":0},{"$f":"'(6)Lease B Tenant'!H5","v":0},{"$f":"'(6)Lease B Tenant'!I5","v":0},{"$f":"'(6)Lease B Tenant'!J5","v":0},{"$f":"'(6)Lease B Tenant'!K5","v":0},{"$f":"'(6)Lease B Tenant'!L5","v":0},{"$f":"'(6)Lease B Tenant'!M5","v":0},{"$f":"'(6)Lease B Tenant'!N5","v":0}]
[null,2,"+Percentage Rent",null,{"$f":"'(6)Lease B Tenant'!E6","v":0},{"$f":"'(6)Lease B Tenant'!F6","v":0},{"$f":"'(6)Lease B Tenant'!G6","v":0},{"$f":"'(6)Lease B Tenant'!H6","v":0},{"$f":"'(6)Lease B Tenant'!I6","v":0},{"$f":"'(6)Lease B Tenant'!J6","v":0},{"$f":"'(6)Lease B Tenant'!K6","v":0},{"$f":"'(6)Lease B Tenant'!L6","v":0},{"$f":"'(6)Lease B Tenant'!M6","v":0},{"$f":"'(6)Lease B Tenant'!N6","v":0}]
{"$rows_left_out":24}
{"sheet":"(8)Lease C Input","index":8,"n_rows":135,"n_cols":14,"rows_kept":135,"cut":false,"hidden":true,"merged":[[41,1,41,2],[36,1,36,2],[23,1,23,2],[7,5,7,6],[1,1,1,2],[22,1,22,2],[31,1,31,2],[2,1,2,2]]}
[]
[null,{"$f":"CONCATENATE(\"Lease C Input Sheet - \",TEXT(TODAY(),\"m/d/yyyy\"))","v":"Lease C Input Sheet - 8/16/2021"}]
[null,"Lease Assumptions"]
[null,1,"Lease Term in Years",null,null,null,100]
[null,2,"Rentable Square Feet"]
[null,3,"Base Rent"]
{"$rows_left_out":130}
{"sheet":"(9)Lease C Tenant","index":9,"n_rows":42,"n_cols":14,"rows_kept":42,"cut":false,"hidden":true,"merged":[[35,1,35,2],[1,1,1,4],[29,1,29,2],[29,3,29,4],[29,5,29,6],[3,1,3,2],[2,1,2,2],[22,1,22,2],[13,1,13,2]]}
[]
[null,"Lease \"C\" Tenant Spreadsheet"]
[null,"Total Occupancy Costs"]
[null,"End of Year",null,"0",1,2,3,4,5,6,7,8,9,10]
[null,1,"Base Rent",null,{"$f":"IF('(8)Lease C Input'!D6<'(8)Lease C Input'!G4,'(8)Lease C Input'!D5*'(8)Lease C Input'!D6,'(8)Lease C Input'!D6)","v":0},{"$f":"IF(F4<='(8)Lease C Input'!$D$4,IF('(8)Lease C Input'!$D$7>0,'(9)Lease C Tenant'!E5+('(8)Lease C Input'!$D$5*'(8)Lease C Input'!$D$7),E5*(1+'(8)Lease C Input'!F25)),0)","v":0},{"$f":"IF(G4<='(8)Lease C Input'!$D$4,IF('(8)Lease C Input'!$D$7>0,'(9)Lease C Tenant'!F5+('(8)Lease C Input'!$D$5*'(8)Lease C Input'!$D$7),F5*(1+'(8)Lease C Input'!G25)),0)","v":0},{"$f":"IF(H4<='(8)Lease C Input'!$D$4,IF('(8)Lease C Input'!$D$7>0,'(9)Lease C Tenant'!G5+('(8)Lease C Input'!$D$5*'(8)Lease C Input'!$D$7),G5*(1+'(8)Lease C Input'!H25)),0)","v":0},{"$f":"IF(I4<='(8)Lease C Input'!$D$4,IF('(8)Lease C Input'!$D$7>0,'(9)Lease C Tenant'!H5+('(8)Lease C Input'!$D$5*'(8)Lease C Input'!$D$7),H5*(1+'(8)Lease C Input'!I25)),0)","v":0},{"$f":"IF(J4<='(8)Lease C Input'!$D$4,IF('(8)Lease C Input'!$D$7>0,'(9)Lease C Tenant'!I5+('(8)Lease C Input'!$D$5*'(8)Lease C Input'!$D$7),I5*(1+'(8)Lease C Input'!J25)),0)","v":0},{"$f":"IF(K4<='(8)Lease C Input'!$D$4,IF('(8)Lease C Input'!$D$7>0,'(9)Lease C Tenant'!J5+('(8)Lease C Input'!$D$5*'(8)Lease C Input'!$D$7),J5*(1+'(8)Lease C Input'!K25)),0)","v":0},{"$f":"IF(L4<='(8)Lease C Input'!$D$4,IF('(8)Lease C Input'!$D$7>0,'(9)Lease C Tenant'!K5+('(8)Lease C Input'!$D$5*'(8)Lease C Input'!$D$7),K5*(1+'(8)Lease C Input'!L25)),0)","v":0},{"$f":"IF(M4<='(8)Lease C Input'!$D$4,IF('(8)Lease C Input'!$D$7>0,'(9)Lease C Tenant'!L5+('(8)Lease C Input'!$D$5*'(8)Lease C Input'!$D$7),L5*(1+'(8)Lease C Input'!M25)),0)","v":0},{"$f":"IF(N4<='(8)Lease C Input'!$D$4,IF('(8)Lease C Input'!$D$7>0,'(9)Lease C Tenant'!M5+('(8)Lease C Input'!$D$5*'(8)Lease C Input'!$D$7),M5*(1+'(8)Lease C Input'!N25)),0)","v":0}]
[null,2,"+Percentage Rent",null,{"$f":"MAX(0,('(8)Lease C Input'!$D$22*'(8)Lease C Input'!$D$5-'(8)Lease C Input'!$F$22)*'(8)Lease C Input'!$E$22)","v":0},{"$f":"IF(F4<='(8)Lease C Input'!$D$4,MAX(0,(('(8)Lease C Input'!$D$22*'(8)Lease C Input'!$D$5*(1+'(8)Lease C Input'!$F$31)-'(8)Lease C Input'!$F$22))*'(8)Lease C Input'!$E$22),0)","v":0},{"$f":"IF(G4<='(8)Lease C Input'!D5,MAX(0,((('(8)Lease C Input'!$D$22*'(8)Lease C Input'!$D$5*(1+'(8)Lease C Input'!$F$31)*(1+'(8)Lease C Input'!$G$31)-'(8)Lease C Input'!$F$22)))*'(8)Lease C Input'!$E$22),0)","v":0},{"$f":"IF(H4<='(8)Lease C Input'!D4,MAX(0,(((('(8)Lease C Input'!$D$22*'(8)Lease C Input'!$D$5*(1+'(8)Lease C Input'!$F$31)*(1+'(8)Lease C Input'!$G$31)*(1+'(8)Lease C Input'!$H$31)-'(8)Lease C Input'!$F$22))))*'(8)Lease C Input'!$E$22),0)","v":0},{"$f":"IF(I4<='(8)Lease C Input'!D4,MAX(0,((((('(8)Lease C Input'!$D$22*'(8)Lease C Input'!$D$5*(1+'(8)Lease C Input'!$F$31)*(1+'(8)Lease C Input'!$G$31)*(1+'(8)Lease C Input'!$H$31)*(1+'(8)Lease C Input'!$I$31)-'(8)Lease C Input'!$F$22)))))*'(8)Lease C Input'!$E$22),0)","v":0},{"$f":"IF(J4<='(8)Lease C Input'!D4,MAX(0,(((((('(8)Lease C Input'!$D$22*'(8)Lease C Input'!$D$5*(1+'(8)Lease C Input'!$F$31)*(1+'(8)Lease C Input'!$G$31)*(1+'(8)Lease C Input'!$H$31)*(1+'(8)Lease C Input'!$I$31)*(1+'(8)Lease C Input'!$J$31)-'(8)Lease C Input'!$F$22))))))*'(8)Lease C Input'!$E$22),0)","v":0},{"$f":"IF(K4<='(8)Lease C Input'!D4,MAX(0,((((((('(8)Lease C Input'!$D$22*'(8)Lease C Input'!$D$5*(1+'(8)Lease C Input'!$F$31)*(1+'(8)Lease C Input'!$G$31)*(1+'(8)Lease C Input'!$H$31)*(1+'(8)Lease C Input'!$I$31)*(1+'(8)Lease C Input'!$J$31)*(1+'(8)Lease C Input'!$K$31)-'(8)Lease C Input'!$F$22)))))))*'(8)Lease C Input'!$E$22),0)","v":0},{"$f":"IF(L4<='(8)Lease C Input'!D4,MAX(0,(((((((('(8)Lease C Input'!$D$22*'(8)Lease C Input'!$D$5*(1+'(8)Lease C Input'!$F$31)*(1+'(8)Lease C Input'!$G$31)*(1+'(8)Lease C Input'!$H$31)*(1+'(8)Lease C Input'!$I$31)*(1+'(8)Lease C Input'!$J$31)*(1+'(8)Lease C Input'!$K$31)*(1+'(8)Lease C Input'!$L$31)-'(8)Lease C Input'!$F$22))))))))*'(8)Lease C Input'!$E$22),0)","v":0},{"$f":"IF(M4<='(8)Lease C Input'!D4,MAX(0,((((((((('(8)Lease C Input'!$D$22*'(8)Lease C Input'!$D$5*(1+'(8)Lease C Input'!$F$31)*(1+'(8)Lease C Input'!$G$31)*(1+'(8)Lease C Input'!$H$31)*(1+'(8)Lease C Input'!$I$31)*(1+'(8)Lease C Input'!$J$31)*(1+'(8)Lease C Input'!$K$31)*(1+'(8)Lease C Input'!$L$31)*(1+'(8)Lease C Input'!$M$31)-'(8)Lease C Input'!$F$22)))))))))*'(8)Lease C Input'!$E$22),0)","v":0},{"$f":"IF(N4<='(8)Lease C Input'!D4,MAX(0,(((((((((('(8)Lease C Input'!$D$22*'(8)Lease C Input'!$D$5*(1+'(8)Lease C Input'!$F$31)*(1+'(8)Lease C Input'!$G$31)*(1+'(8)Lease C Input'!$H$31)*(1+'(8)Lease C Input'!$I$31)*(1+'(8)Lease C Input'!$J$31)*(1+'(8)Lease C Input'!$K$31)*(1+'(8)Lease C Input'!$L$31)*(1+'(8)Lease C Input'!$M$31)*(1+'(8)Lease C Input'!$N$31)-'(8)Lease C Input'!$F$22))))))))))*'(8)Lease C Input'!$E$22),0)","v":0}]
{"$rows_left_out":37}
{"sheet":"(10)Lease C Owner","index":10,"n_rows":29,"n_cols":14,"rows_kept":29,"cut":false,"hidden":true,"merged":[[1,1,1,3],[2,1,2,2],[10,1,10,2],[27,5,27,6],[19,1,19,2],[27,1,27,2],[3,1,3,2],[27,3,27,4]]}
[]
[null,"Lease \"C\" Owner Spreadsheet"]
[null,"Collections"]
[null,"End of Year",null,"0",1,2,3,4,5,6,7,8,9,10]
[null,1,"Base Rent",null,{"$f":"'(9)Lease C Tenant'!E5","v":0},{"$f":"'(9)Lease C Tenant'!F5","v":0},{"$f":"'(9)Lease C Tenant'!G5","v":0},{"$f":"'(9)Lease C Tenant'!H5","v":0},{"$f":"'(9)Lease C Tenant'!I5","v":0},{"$f":"'(9)Lease C Tenant'!J5","v":0},{"$f":"'(9)Lease C Tenant'!K5","v":0},{"$f":"'(9)Lease C Tenant'!L5","v":0},{"$f":"'(9)Lease C Tenant'!M5","v":0},{"$f":"'(9)Lease C Tenant'!N5","v":0}]
[null,2,"+Percentage Rent",null,{"$f":"'(9)Lease C Tenant'!E6","v":0},{"$f":"'(9)Lease C Tenant'!F6","v":0},{"$f":"'(9)Lease C Tenant'!G6","v":0},{"$f":"'(9)Lease C Tenant'!H6","v":0},{"$f":"'(9)Lease C Tenant'!I6","v":0},{"$f":"'(9)Lease C Tenant'!J6","v":0},{"$f":"'(9)Lease C Tenant'!K6","v":0},{"$f":"'(9)Lease C Tenant'!L6","v":0},{"$f":"'(9)Lease C Tenant'!M6","v":0},{"$f":"'(9)Lease C Tenant'!N6","v":0}]
{"$rows_left_out":24}
{"sheet":"(11)Before Tax Summary","index":11,"n_rows":38,"n_cols":12,"rows_kept":38,"cut":false,"hidden":true,"merged":[[37,1,37,3],[0,1,0,12],[3,4,3,5],[3,7,3,8],[3,10,3,11],[1,1,1,6],[23,7,23,8],[23,10,23,11],[2,1,2,12],[22,1,22,12],[23,4,23,5],[21,1,21,3],[17,1,17,3],[18,1,18,3],[19,1,19,3],[20,1,20,3]]}
[]
[null,"Before Tax Summary"]
[null,"Tenant"]
[null,null,null,null,"Lease A",null,null,"Lease B",null,null,"Lease C"]
[null,null,null,null,"EOY","$",null,"EOY","$",null,"EOY","$"]
[null,null,null,null,{"$f":"IF('Lease Input'!$D$4>0,\"O\",0)","v":0},{"$f":"'Occupancy Costs'!D24","v":0},null,{"$f":"IF('(5)Lease B Input'!$D$4>0,\"O\",0)","v":0},{"$f":"'(6)Lease B Tenant'!D24","v":0},null,{"$f":"IF('(8)Lease C Input'!$D$4>0,\"O\",0)","v":0},{"$f":"'(9)Lease C Tenant'!D24","v":0}]
{"$rows_left_out":33}
{"sheet":"(12)After Tax Summary","index":12,"n_rows":38,"n_cols":12,"rows_kept":38,"cut":false,"hidden":true,"merged":[[37,1,37,3],[1,1,1,6],[17,1,17,3],[18,1,18,3],[19,1,19,3],[2,1,2,12],[22,1,22,12],[3,4,3,5],[3,7,3,8],[3,10,3,11],[23,4,23,5],[23,7,23,8],[21,1,21,3],[20,1,20,3],[23,10,23,11]]}
[]
[null,"After Tax Summary"]
[null,"Tenant"]
[null,null,null,null,"Lease A",null,null,"Lease B",null,null,"Lease C"]
[null,null,null,null,"EOY","$",null,"EOY","$",null,"EOY","$"]
[null,null,null,null,{"$f":"IF('Lease Input'!$D$4>0,\"O\",0)","v":0},{"$f":"'Occupancy Costs'!D29","v":0},null,{"$f":"IF('(5)Lease B Input'!$D$4>0,\"O\",0)","v":0},{"$f":"'(6)Lease B Tenant'!D29","v":0},null,{"$f":"IF('(8)Lease C Input'!$D$4>0,\"O\",0)","v":0},{"$f":"'(9)Lease C Tenant'!D29","v":0}]
{"$rows_left_out":32}